{"text_format":"1","workbook":"xlsx","n_sheets":7,"sheets":["Doku Rind","Doku Pferd,Schaf,Gehegewild","Doku Schwein","Doku Geflügel","Daten Nährstoffanfall","Weideverluste","Daten Weideverfahren"],"not_rendered":{"charts":0,"images":1,"macros":1,"external_links":0,"defined_names":0,"comments":0,"pivot_tables":0},"unopened":[],"bounds":{"document_bytes":16777216,"sheet_cells":100000,"rows_first":2000,"rows_last":500,"rows_between":2000,"halvings":0,"cell_chars":16384,"cell_head_chars":4096},"cells_cut":0,"cells_raw":0,"read":"whole","date_system":"1900"}

{"sheet":"Doku Rind","index":0,"n_rows":48,"n_cols":22,"rows_kept":48,"cut":false,"hidden":false,"merged":[[31,0,31,4],[31,5,31,16],[28,10,30,16],[0,10,0,12],[0,14,0,16],[27,10,27,11],[1,12,1,16],[0,6,1,6],[0,0,1,5],[2,2,27,2],[27,0,27,1],[28,0,30,4],[28,5,30,6]]}
["Weidetagebuch",null,null,null,null,null,"Weidetagebuch",null,null,null,"Ausgefüllt am:"]
[null,null,null,null,null,null,null,null,null,null,null,null,"Anfall auf der Weide"]
[null,null,null,"Weideverfahren","Größe (ha)","Anzahl Tiere","Tierart","N (kg/Jahr)","P2O5 (kg/Jahr)","K2O (kg/Jahr)","Tage","Stunden","N-Anfall (kg)","N-Anfall (kg/ha)","P2O5-Anfall (kg)","P2O5-Anfall (kg/ha)","K2O-Anfall (kg)","K2O-Anfall (kg/ha)"]
["Weidejahr:",2020,null,null,null,null,null,{"$f":"VLOOKUP(G4,'Daten Nährstoffanfall'!$C$3:$D$47,2,FALSE)","v":{"$error":"#N/A"}},{"$f":"VLOOKUP(G4,'Daten Nährstoffanfall'!$C$3:$E$47,3,FALSE)","v":{"$error":"#N/A"}},{"$f":"VLOOKUP(G4,'Daten Nährstoffanfall'!$C$3:$F$47,4,FALSE)","v":{"$error":"#N/A"}},null,null,{"$f":"IFERROR(IF(((H4*(K4/365))*(L4/24)*F4)*0.7,((H4*(K4/365))*(L4/24)*F4)*0.7,\"\"),\"\")","v":""},{"$f":"M4/E4","v":{"$error":"#VALUE!"}},{"$f":"IFERROR(IF(((I4*(K4/365)*L4/24)*F4)*0.7,((I4*(K4/365)*L4/24)*F4),\"\"),\"\")","v":""},{"$f":"O4/E4","v":{"$error":"#VALUE!"}},{"$f":"IFERROR(IF(((J4*(K4/365)*(L4/24)*F4)*0.7),((J4*(K4/365)*(L4/24)*F4)),\"\"),\"\")","v":""},{"$f":"Q4/E4","v":{"$error":"#VALUE!"}},"Jungrinderaufzucht, Grünland; konventionell;  0 bis 6 Monate",28,9.16,34.799999999999997]
["Unternehmernummer:",null,null,null,null,null,null,{"$f":"VLOOKUP(G5,'Daten Nährstoffanfall'!$C$3:$D$47,2,FALSE)","v":{"$error":"#N/A"}},{"$f":"VLOOKUP(G5,'Daten Nährstoffanfall'!$C$3:$E$47,3,FALSE)","v":{"$error":"#N/A"}},{"$f":"VLOOKUP(G5,'Daten Nährstoffanfall'!$C$3:$F$47,4,FALSE)","v":{"$error":"#N/A"}},null,null,{"$f":"IFERROR(IF(((H5*(K5/365))*(L5/24)*F5)*0.7,((H5*(K5/365))*(L5/24)*F5)*0.7,\"\"),\"\")","v":""},{"$f":"M5/E5","v":{"$error":"#VALUE!"}},{"$f":"IFERROR(IF(((I5*(K5/365)*L5/24)*F5)*0.7,((I5*(K5/365)*L5/24)*F5),\"\"),\"\")","v":""},{"$f":"O5/E5","v":{"$error":"#VALUE!"}},{"$f":"IFERROR(IF(((J5*(K5/365)*(L5/24)*F5)*0.7),((J5*(K5/365)*(L5/24)*F5)),\"\"),\"\")","v":""},{"$f":"Q5/E5","v":{"$error":"#VALUE!"}},"Jungrinderaufzucht, Grünland; konventionell; 7 bis 12 Monate",47,13.74,57.6]
["Name:",null,null,null,null,null,null,{"$f":"VLOOKUP(G6,'Daten Nährstoffanfall'!$C$3:$D$47,2,FALSE)","v":{"$error":"#N/A"}},{"$f":"VLOOKUP(G6,'Daten Nährstoffanfall'!$C$3:$E$47,3,FALSE)","v":{"$error":"#N/A"}},{"$f":"VLOOKUP(G6,'Daten Nährstoffanfall'!$C$3:$F$47,4,FALSE)","v":{"$error":"#N/A"}},null,null,"",{"$f":"M6/E6","v":{"$error":"#VALUE!"}},"",{"$error":"#VALUE!"},"",{"$error":"#VALUE!"},"Jungrinderaufzucht, Grünland; konventionell; 13 bis 24 Monate",72,20.61,93.6]
["Vorname:",null,null,null,null,null,null,{"$f":"VLOOKUP(G7,'Daten Nährstoffanfall'!$C$3:$D$47,2,FALSE)","v":{"$error":"#N/A"}},{"$f":"VLOOKUP(G7,'Daten Nährstoffanfall'!$C$3:$E$47,3,FALSE)","v":{"$error":"#N/A"}},{"$f":"VLOOKUP(G7,'Daten Nährstoffanfall'!$C$3:$F$47,4,FALSE)","v":{"$error":"#N/A"}},null,null,"",{"$f":"M7/E7","v":{"$error":"#VALUE!"}},"",{"$error":"#VALUE!"},"",{"$error":"#VALUE!"},"Jungrinderaufzucht, Grünland; konventionell; über 24 Monate",84,22.9,99.6]
["Straße: ",null,null,null,null,null,null,{"$f":"VLOOKUP(G8,'Daten Nährstoffanfall'!$C$3:$D$47,2,FALSE)","v":{"$error":"#N/A"}},{"$f":"VLOOKUP(G8,'Daten Nährstoffanfall'!$C$3:$E$47,3,FALSE)","v":{"$error":"#N/A"}},{"$f":"VLOOKUP(G8,'Daten Nährstoffanfall'!$C$3:$F$47,4,FALSE)","v":{"$error":"#N/A"}},null,null,"",{"$error":"#VALUE!"},"",{"$f":"O8/E8","v":{"$error":"#VALUE!"}},"",{"$error":"#VALUE!"},"Jungrinderaufzucht, Grünland; extensiv;  0 bis 6 Monate; Futterbasis Naturschutzgrünland",28,9.16,30]
["PLZ:",null,null,null,null,null,null,{"$f":"VLOOKUP(G9,'Daten Nährstoffanfall'!$C$3:$D$47,2,FALSE)","v":{"$error":"#N/A"}},{"$f":"VLOOKUP(G9,'Daten Nährstoffanfall'!$C$3:$E$47,3,FALSE)","v":{"$error":"#N/A"}},{"$f":"VLOOKUP(G9,'Daten Nährstoffanfall'!$C$3:$F$47,4,FALSE)","v":{"$error":"#N/A"}},null,null,"",{"$error":"#VALUE!"},"",{"$error":"#VALUE!"},"",{"$error":"#VALUE!"},"Jungrinderaufzucht, Grünland; extensiv; 7 bis 12 Monate; Futterbasis Naturschutzgrünland",44,13.74,48]
["Ort:",null,null,null,null,null,null,{"$f":"VLOOKUP(G10,'Daten Nährstoffanfall'!$C$3:$D$47,2,FALSE)","v":{"$error":"#N/A"}},{"$f":"VLOOKUP(G10,'Daten Nährstoffanfall'!$C$3:$E$47,3,FALSE)","v":{"$error":"#N/A"}},{"$f":"VLOOKUP(G10,'Daten Nährstoffanfall'!$C$3:$F$47,4,FALSE)","v":{"$error":"#N/A"}},null,null,"",{"$error":"#VALUE!"},"",{"$error":"#VALUE!"},"",{"$error":"#VALUE!"},"Jungrinderaufzucht, Grünland; extensiv; 13 bis 24 Monate; Futterbasis Naturschutzgrünland",67,20.61,73.2]
{"$rows_left_out":39}
{"sheet":"Doku Pferd,Schaf,Gehegewild","index":1,"n_rows":33,"n_cols":21,"rows_kept":33,"cut":false,"hidden":false,"merged":[[32,0,32,4],[32,5,32,20],[0,14,0,16],[28,10,28,11],[29,10,31,16],[0,10,0,12],[1,12,1,16],[0,6,1,6],[0,0,1,5],[2,2,28,2],[28,0,28,1],[29,0,31,4],[29,5,31,6]]}
["Weidetagebuch",null,null,null,null,null,"Weidetagebuch",null,null,null,"Ausgefüllt am:"]
[null,null,null,null,null,null,null,null,null,null,null,null,"Anfall auf der Weide"]
[null,null,null,"Weideverfahren","Größe (ha)","Anzahl Tiere","Tierart","N (kg/Jahr)","P2O5 (kg/Jahr)","K2O (kg/Jahr)","Tage","Stunden","N-Anfall (kg)","N-Anfall (kg/ha)","P2O5-Anfall (kg)","P2O5-Anfall (kg/ha)","K2O-Anfall (kg)","Schafe, Ziegen, Wild, Kaninchen"]
["Weidejahr:",2020,null,null,null,null,null,{"$f":"VLOOKUP(G4,'Daten Nährstoffanfall'!$C$206:$D$222,2,FALSE)","v":{"$error":"#N/A"}},{"$f":"VLOOKUP(G4,'Daten Nährstoffanfall'!$C$206:$E$222,3,FALSE)","v":{"$error":"#N/A"}},{"$f":"VLOOKUP(G4,'Daten Nährstoffanfall'!$C$206:$F$222,4,FALSE)","v":{"$error":"#N/A"}},null,null,{"$f":"IFERROR(IF(((H4*(K4/365))*(L4/24)*F4)*0.55,((H4*(K4/365))*(L4/24)*F4)*0.55,\"\"),\"\")","v":""},{"$f":"M4/E4","v":{"$error":"#VALUE!"}},{"$f":"IFERROR(IF(((I4*(K4/365)*(L4/24)*F4)*0.55),((I4*(K4/365)*(L4/24)*F4)),\"\"),\"\")","v":""},{"$f":"O4/E4","v":{"$error":"#VALUE!"}},{"$f":"IFERROR(IF(((J4*(K4/365)*(L4/24)*F4)*0.55),((J4*(K4/365)*(L4/24)*F4)),\"\"),\"\")","v":""},"Reitpferde, 500 - 600 kg LM; leichte Arbeit; Stallhaltung",51.1,23.4,57.5]
["Unternehmernummer:",null,null,null,null,null,null,{"$f":"VLOOKUP(G5,'Daten Nährstoffanfall'!$C$206:$D$222,2,FALSE)","v":{"$error":"#N/A"}},{"$f":"VLOOKUP(G5,'Daten Nährstoffanfall'!$C$206:$E$222,3,FALSE)","v":{"$error":"#N/A"}},{"$f":"VLOOKUP(G5,'Daten Nährstoffanfall'!$C$206:$F$222,4,FALSE)","v":{"$error":"#N/A"}},null,null,{"$f":"IFERROR(IF(((H5*(K5/365))*(L5/24)*F5)*0.55,((H5*(K5/365))*(L5/24)*F5)*0.55,\"\"),\"\")","v":""},{"$f":"M5/E5","v":{"$error":"#VALUE!"}},{"$f":"IFERROR(IF(((I5*(K5/365)*(L5/24)*F5)*0.55),((I5*(K5/365)*(L5/24)*F5)),\"\"),\"\")","v":""},{"$f":"O5/E5","v":{"$error":"#VALUE!"}},{"$f":"IFERROR(IF(((J5*(K5/365)*(L5/24)*F5)*0.55),((J5*(K5/365)*(L5/24)*F5)),\"\"),\"\")","v":""},"Reitpferde, 500 - 600 kg LM; leichte Arbeit; Stall-/Weidehaltung",53.6,23.4,67]
["Name:",null,null,null,null,null,null,{"$f":"VLOOKUP(G6,'Daten Nährstoffanfall'!$C$206:$D$222,2,FALSE)","v":{"$error":"#N/A"}},{"$f":"VLOOKUP(G6,'Daten Nährstoffanfall'!$C$206:$E$222,3,FALSE)","v":{"$error":"#N/A"}},{"$f":"VLOOKUP(G6,'Daten Nährstoffanfall'!$C$206:$F$222,4,FALSE)","v":{"$error":"#N/A"}},null,null,"",{"$error":"#VALUE!"},"",{"$error":"#VALUE!"},"","Reitponys, 300 kg LM; leichte Arbeit; Stallhaltung",34.9,16.5,47]
["Vorname:",null,null,null,null,null,null,{"$f":"VLOOKUP(G7,'Daten Nährstoffanfall'!$C$206:$D$222,2,FALSE)","v":{"$error":"#N/A"}},{"$f":"VLOOKUP(G7,'Daten Nährstoffanfall'!$C$206:$E$222,3,FALSE)","v":{"$error":"#N/A"}},{"$f":"VLOOKUP(G7,'Daten Nährstoffanfall'!$C$206:$F$222,4,FALSE)","v":{"$error":"#N/A"}},null,null,"",{"$error":"#VALUE!"},"",{"$error":"#VALUE!"},"","Reitponys, 300 kg LM; leichte Arbeit; Stall-/Weidehaltung",33.4,15.3,51]
["Straße: ",null,null,null,null,null,null,{"$f":"VLOOKUP(G8,'Daten Nährstoffanfall'!$C$206:$D$222,2,FALSE)","v":{"$error":"#N/A"}},{"$f":"VLOOKUP(G8,'Daten Nährstoffanfall'!$C$206:$E$222,3,FALSE)","v":{"$error":"#N/A"}},{"$f":"VLOOKUP(G8,'Daten Nährstoffanfall'!$C$206:$F$222,4,FALSE)","v":{"$error":"#N/A"}},null,null,"",{"$error":"#VALUE!"},"",{"$f":"O8/E8","v":{"$error":"#VALUE!"}},"","Zuchtstuten, Stall-/Weidehaltung; Großpferd; 600 kg LM;   0,5 Fohlen/Jahr",63.5,28,73.7]
["PLZ:",null,null,null,null,null,null,{"$f":"VLOOKUP(G9,'Daten Nährstoffanfall'!$C$206:$D$222,2,FALSE)","v":{"$error":"#N/A"}},{"$f":"VLOOKUP(G9,'Daten Nährstoffanfall'!$C$206:$E$222,3,FALSE)","v":{"$error":"#N/A"}},{"$f":"VLOOKUP(G9,'Daten Nährstoffanfall'!$C$206:$F$222,4,FALSE)","v":{"$error":"#N/A"}},null,null,"",{"$error":"#VALUE!"},"",{"$error":"#VALUE!"},"","Zuchtstuten, Stall-/Weidehaltung; Pony 350 kg LM; 0,5 Fohlen/Jahr",42.3,18.399999999999999,56.3]
["Ort:",null,null,null,null,null,null,{"$f":"VLOOKUP(G10,'Daten Nährstoffanfall'!$C$206:$D$222,2,FALSE)","v":{"$error":"#N/A"}},{"$f":"VLOOKUP(G10,'Daten Nährstoffanfall'!$C$206:$E$222,3,FALSE)","v":{"$error":"#N/A"}},{"$f":"VLOOKUP(G10,'Daten Nährstoffanfall'!$C$206:$F$222,4,FALSE)","v":{"$error":"#N/A"}},null,null,"",{"$error":"#VALUE!"},"",{"$error":"#VALUE!"},"","Aufzuchtpferde, Stall-/Weidehaltung; Großpferd; 6. - 36. Monat;  365 kg Zuwachs",44.5,18.899999999999999,54.3]
{"$rows_left_out":24}
{"sheet":"Doku Schwein","index":2,"n_rows":132,"n_cols":21,"rows_kept":132,"cut":false,"hidden":false,"merged":[[32,0,32,4],[32,5,32,16],[29,10,31,16],[0,10,0,12],[0,14,0,16],[28,10,28,11],[1,12,1,16],[0,6,1,6],[0,0,1,5],[2,2,28,2],[28,0,28,1],[29,0,31,4],[29,5,31,6]]}
["Weidetagebuch",null,null,null,null,null,"Weidetagebuch",null,null,null,"Ausgefüllt am:"]
[null,null,null,null,null,null,null,null,null,null,null,null,"Anfall auf der Weide"]
[null,null,null,"Weideverfahren","Größe (ha)","Anzahl Tiere","Tierart","N (kg/Jahr)","P2O5 (kg/Jahr)","K2O (kg/Jahr)","Tage","Stunden","N-Anfall (kg)","N-Anfall (kg/ha)","P2O5-Anfall (kg)","P2O5-Anfall (kg/ha)","K2O-Anfall (kg)","Sauenhaltung, Ferkelaufzucht bis 8 kg LM; 22 aufgezogene Ferkel; 216 kg Zuwachs je Platz/Jahr;  Universalfutter",27.1,12.6,12.8]
["Weidejahr:",2020,null,null,null,null,null,{"$f":"IFERROR(VLOOKUP(G4,'Daten Nährstoffanfall'!$C$50:$D$178,2,FALSE),\"\")","v":""},{"$f":"IFERROR(VLOOKUP(G4,'Daten Nährstoffanfall'!$C$50:$E$178,3,FALSE),\"\")","v":""},{"$f":"IFERROR(VLOOKUP(G4,'Daten Nährstoffanfall'!$C$50:$F$178,4,FALSE),\"\")","v":""},null,null,{"$f":"IFERROR(((H4*(K4/365))*(L4/24)*F4)*0.7,\"\")","v":""},{"$f":"M4/E4","v":{"$error":"#VALUE!"}},{"$f":"IFERROR(((I4*(K4/365)*L4/24)*F4),\"\")","v":""},{"$f":"O4/E4","v":{"$error":"#VALUE!"}},{"$f":"IFERROR(((J4*(K4/365)*(L4/24)*F4)),\"\")","v":""},"Sauenhaltung, Ferkelaufzucht bis 8 kg LM; 22 aufgezogene Ferkel; 216 kg Zuwachs je Platz/Jahr; N-/P-reduziert",24,11,11.6]
["Unternehmernummer:",null,null,null,null,null,null,{"$f":"IFERROR(VLOOKUP(G5,'Daten Nährstoffanfall'!$C$50:$D$178,2,FALSE),\"\")","v":""},{"$f":"IFERROR(VLOOKUP(G5,'Daten Nährstoffanfall'!$C$50:$E$178,3,FALSE),\"\")","v":""},{"$f":"IFERROR(VLOOKUP(G5,'Daten Nährstoffanfall'!$C$50:$F$178,4,FALSE),\"\")","v":""},null,null,{"$f":"IFERROR(((H5*(K5/365))*(L5/24)*F5)*0.7,\"\")","v":""},{"$f":"M5/E5","v":{"$error":"#VALUE!"}},{"$f":"IFERROR(((I5*(K5/365)*L5/24)*F5),\"\")","v":""},{"$f":"O5/E5","v":{"$error":"#VALUE!"}},{"$f":"IFERROR(((J5*(K5/365)*(L5/24)*F5)),\"\")","v":""},"Sauenhaltung, Ferkelaufzucht bis 8 kg LM; 22 aufgezogene Ferkel; 216 kg Zuwachs je Platz/Jahr; stark N-/P- reduziert",23,10.3,11.6]
["Name:",null,null,null,null,null,null,{"$f":"IFERROR(VLOOKUP(G6,'Daten Nährstoffanfall'!$C$50:$D$178,2,FALSE),\"\")","v":""},{"$f":"IFERROR(VLOOKUP(G6,'Daten Nährstoffanfall'!$C$50:$E$178,3,FALSE),\"\")","v":""},{"$f":"IFERROR(VLOOKUP(G6,'Daten Nährstoffanfall'!$C$50:$F$178,4,FALSE),\"\")","v":""},null,null,"",{"$f":"M6/E6","v":{"$error":"#VALUE!"}},"",{"$error":"#VALUE!"},"","Sauenhaltung, Ferkelaufzucht bis 8 kg LM; 22 aufgezogene Ferkel; 216 kg Zuwachs je Platz/Jahr; sehr stark N-/P- reduziert",22,9.6559633027522942,10.602409638554219]
["Vorname:",null,null,null,null,null,null,{"$f":"IFERROR(VLOOKUP(G7,'Daten Nährstoffanfall'!$C$50:$D$178,2,FALSE),\"\")","v":""},{"$f":"IFERROR(VLOOKUP(G7,'Daten Nährstoffanfall'!$C$50:$E$178,3,FALSE),\"\")","v":""},{"$f":"IFERROR(VLOOKUP(G7,'Daten Nährstoffanfall'!$C$50:$F$178,4,FALSE),\"\")","v":""},null,null,"",{"$f":"M7/E7","v":{"$error":"#VALUE!"}},"",{"$error":"#VALUE!"},"","Sauenhaltung, Ferkelaufzucht bis 8 kg LM; 25 aufgezogene Ferkel; 239 kg Zuwachs je Platz/Jahr;  Universalfutter",27.3,12.6,12.8]
["Straße: ",null,null,null,null,null,null,{"$f":"IFERROR(VLOOKUP(G8,'Daten Nährstoffanfall'!$C$50:$D$178,2,FALSE),\"\")","v":""},{"$f":"IFERROR(VLOOKUP(G8,'Daten Nährstoffanfall'!$C$50:$E$178,3,FALSE),\"\")","v":""},{"$f":"IFERROR(VLOOKUP(G8,'Daten Nährstoffanfall'!$C$50:$F$178,4,FALSE),\"\")","v":""},null,null,"",{"$error":"#VALUE!"},"",{"$f":"O8/E8","v":{"$error":"#VALUE!"}},"","Sauenhaltung, Ferkelaufzucht bis 8 kg LM; 25 aufgezogene Ferkel; 239 kg Zuwachs je Platz/Jahr; N-/P-reduziert",24.1,11.2,11.6]
["PLZ:",null,null,null,null,null,null,{"$f":"IFERROR(VLOOKUP(G9,'Daten Nährstoffanfall'!$C$50:$D$178,2,FALSE),\"\")","v":""},{"$f":"IFERROR(VLOOKUP(G9,'Daten Nährstoffanfall'!$C$50:$E$178,3,FALSE),\"\")","v":""},{"$f":"IFERROR(VLOOKUP(G9,'Daten Nährstoffanfall'!$C$50:$F$178,4,FALSE),\"\")","v":""},null,null,"",{"$error":"#VALUE!"},"",{"$error":"#VALUE!"},"","Sauenhaltung, Ferkelaufzucht bis 8 kg LM; 25 aufgezogene Ferkel; 239 kg Zuwachs je Platz/Jahr; stark N-/P-reduziert",23.1,10.3,11.6]
["Ort:",null,null,null,null,null,null,{"$f":"IFERROR(VLOOKUP(G10,'Daten Nährstoffanfall'!$C$50:$D$178,2,FALSE),\"\")","v":""},{"$f":"IFERROR(VLOOKUP(G10,'Daten Nährstoffanfall'!$C$50:$E$178,3,FALSE),\"\")","v":""},{"$f":"IFERROR(VLOOKUP(G10,'Daten Nährstoffanfall'!$C$50:$F$178,4,FALSE),\"\")","v":""},null,null,"",{"$error":"#VALUE!"},"",{"$error":"#VALUE!"},"","Sauenhaltung, Ferkelaufzucht bis 8 kg LM; 25 aufgezogene Ferkel; 239 kg Zuwachs je Platz/Jahr; sehr stark N-/P-reduziert",22.1,9.6788990825688064,10.843373493975903]
{"$rows_left_out":123}
{"sheet":"Doku Geflügel","index":3,"n_rows":33,"n_cols":17,"rows_kept":33,"cut":false,"hidden":false,"merged":[[32,0,32,4],[32,5,32,16],[29,10,31,16],[0,10,0,12],[0,14,0,16],[28,10,28,11],[1,12,1,16],[0,6,1,6],[0,0,1,5],[2,2,28,2],[28,0,28,1],[29,0,31,4],[29,5,31,6]]}
["Weidetagebuch",null,null,null,null,null,"Weidetagebuch",null,null,null,"Ausgefüllt am:"]
[null,null,null,null,null,null,null,null,null,null,null,null,"Anfall auf der Weide"]
[null,null,null,"Weideverfahren","Größe (ha)","Anzahl Tiere","Tierart","N (kg/Jahr)","P2O5 (kg/Jahr)","K2O (kg/Jahr)","Tage","Stunden","N-Anfall (kg)","N-Anfall (kg/ha)","P2O5-Anfall (kg)","P2O5-Anfall (kg/ha)","K2O-Anfall (kg)"]
["Weidejahr:",2020,null,null,null,null,null,{"$f":"VLOOKUP(G4,'Daten Nährstoffanfall'!$C$180:$D$204,2,FALSE)","v":{"$error":"#N/A"}},{"$f":"VLOOKUP(G4,'Daten Nährstoffanfall'!$C$180:$E$204,3,FALSE)","v":{"$error":"#N/A"}},{"$f":"VLOOKUP(G4,'Daten Nährstoffanfall'!$C$180:$F$204,4,FALSE)","v":{"$error":"#N/A"}},null,null,{"$f":"IFERROR(((H4*(K4/365))*(L4/24)*F4)*0.6,\"\")","v":""},{"$f":"M4/E4","v":{"$error":"#VALUE!"}},{"$f":"IFERROR(((I4*(K4/365)*L4/24)*F4),\"\")","v":""},{"$f":"O4/E4","v":{"$error":"#VALUE!"}},{"$f":"IFERROR(((J4*(K4/365)*(L4/24)*F4)),\"\")","v":""}]
["Unternehmernummer:",null,null,null,null,null,null,{"$f":"VLOOKUP(G5,'Daten Nährstoffanfall'!$C$180:$D$204,2,FALSE)","v":{"$error":"#N/A"}},{"$f":"VLOOKUP(G5,'Daten Nährstoffanfall'!$C$180:$E$204,3,FALSE)","v":{"$error":"#N/A"}},{"$f":"VLOOKUP(G5,'Daten Nährstoffanfall'!$C$180:$F$204,4,FALSE)","v":{"$error":"#N/A"}},null,null,{"$f":"IFERROR(((H5*(K5/365))*(L5/24)*F5)*0.6,\"\")","v":""},{"$f":"M5/E5","v":{"$error":"#VALUE!"}},{"$f":"IFERROR(((I5*(K5/365)*L5/24)*F5),\"\")","v":""},{"$f":"O5/E5","v":{"$error":"#VALUE!"}},{"$f":"IFERROR(((J5*(K5/365)*(L5/24)*F5)),\"\")","v":""}]
["Name:",null,null,null,null,null,null,{"$f":"VLOOKUP(G6,'Daten Nährstoffanfall'!$C$180:$D$204,2,FALSE)","v":{"$error":"#N/A"}},{"$f":"VLOOKUP(G6,'Daten Nährstoffanfall'!$C$180:$E$204,3,FALSE)","v":{"$error":"#N/A"}},{"$f":"VLOOKUP(G6,'Daten Nährstoffanfall'!$C$180:$F$204,4,FALSE)","v":{"$error":"#N/A"}},null,null,"",{"$f":"M6/E6","v":{"$error":"#VALUE!"}},"",{"$error":"#VALUE!"},""]
["Vorname:",null,null,null,null,null,null,{"$f":"VLOOKUP(G7,'Daten Nährstoffanfall'!$C$180:$D$204,2,FALSE)","v":{"$error":"#N/A"}},{"$f":"VLOOKUP(G7,'Daten Nährstoffanfall'!$C$180:$E$204,3,FALSE)","v":{"$error":"#N/A"}},{"$f":"VLOOKUP(G7,'Daten Nährstoffanfall'!$C$180:$F$204,4,FALSE)","v":{"$error":"#N/A"}},null,null,"",{"$f":"M7/E7","v":{"$error":"#VALUE!"}},"",{"$error":"#VALUE!"},""]
["Straße: ",null,null,null,null,null,null,{"$f":"VLOOKUP(G8,'Daten Nährstoffanfall'!$C$180:$D$204,2,FALSE)","v":{"$error":"#N/A"}},{"$f":"VLOOKUP(G8,'Daten Nährstoffanfall'!$C$180:$E$204,3,FALSE)","v":{"$error":"#N/A"}},{"$f":"VLOOKUP(G8,'Daten Nährstoffanfall'!$C$180:$F$204,4,FALSE)","v":{"$error":"#N/A"}},null,null,"",{"$error":"#VALUE!"},"",{"$f":"O8/E8","v":{"$error":"#VALUE!"}},""]
["PLZ:",null,null,null,null,null,null,{"$f":"VLOOKUP(G9,'Daten Nährstoffanfall'!$C$180:$D$204,2,FALSE)","v":{"$error":"#N/A"}},{"$f":"VLOOKUP(G9,'Daten Nährstoffanfall'!$C$180:$E$204,3,FALSE)","v":{"$error":"#N/A"}},{"$f":"VLOOKUP(G9,'Daten Nährstoffanfall'!$C$180:$F$204,4,FALSE)","v":{"$error":"#N/A"}},null,null,"",{"$error":"#VALUE!"},"",{"$error":"#VALUE!"},""]
["Ort:",null,null,null,null,null,null,{"$f":"VLOOKUP(G10,'Daten Nährstoffanfall'!$C$180:$D$204,2,FALSE)","v":{"$error":"#N/A"}},{"$f":"VLOOKUP(G10,'Daten Nährstoffanfall'!$C$180:$E$204,3,FALSE)","v":{"$error":"#N/A"}},{"$f":"VLOOKUP(G10,'Daten Nährstoffanfall'!$C$180:$F$204,4,FALSE)","v":{"$error":"#N/A"}},null,null,"",{"$error":"#VALUE!"},"",{"$error":"#VALUE!"},""]
{"$rows_left_out":24}
{"sheet":"Daten Nährstoffanfall","index":4,"n_rows":222,"n_cols":6,"rows_kept":222,"cut":false,"hidden":false,"merged":[[0,3,0,5]]}
[null,null,null,"Nährstoffanfall (kg)"]
[null,null,null,"N","P2O5","K2O"]
[null,10,"Jungrinderaufzucht, Grünland; konventionell;  0 bis 6 Monate",28,9.16,34.799999999999997]
[null,11,"Jungrinderaufzucht, Grünland; konventionell; 7 bis 12 Monate",47,13.74,57.6]
[null,12,"Jungrinderaufzucht, Grünland; konventionell; 13 bis 24 Monate",72,20.61,93.6]
[null,13,"Jungrinderaufzucht, Grünland; konventionell; über 24 Monate",84,22.9,99.6]
[null,14,"Jungrinderaufzucht, Grünland; extensiv;  0 bis 6 Monate; Futterbasis Naturschutzgrünland",28,9.16,30]
[null,15,"Jungrinderaufzucht, Grünland; extensiv; 7 bis 12 Monate; Futterbasis Naturschutzgrünland",44,13.74,48]
[null,16,"Jungrinderaufzucht, Grünland; extensiv; 13 bis 24 Monate; Futterbasis Naturschutzgrünland",67,20.61,73.2]
[null,17,"Jungrinderaufzucht, Grünland; extensiv; über 24 Monate; Futterbasis Naturschutzgrünland",77,22.9,84]
{"$rows_left_out":213}
{"sheet":"Weideverluste","index":5,"n_rows":9,"n_cols":5,"rows_kept":9,"cut":false,"hidden":false,"merged":[]}
["Art","Aufbringungs-verluste (%)","Lagerungs-verluste (%)","TS-Abbau in %","Weideverluste (%)"]
["Rindermist",14.29,30,10,30]
["Schweinemist",14.29,30,5,30]
["sonstiger Mist",9.1,45,10,45]
["Geflügelmist",16.7,40,5,40]
["sonstiger Mist Huf- und Klauentiere",9.1,45,10,45]
["Geflügelkot",16.7,40,5,40]
["Rindergülle",17.7,15,5,30]
["Schweinegülle",12.5,20,10,30]

{"sheet":"Daten Weideverfahren","index":6,"n_rows":9,"n_cols":2,"rows_kept":9,"cut":false,"hidden":false,"merged":[]}
["DGL-TM Mähweide extensiv 60 % Weide %RP 12,5",67]
["DGL-TM Mähweide mittel 60 % Weide %RP 16,3",81]
["DGL-TM Mähweide intensiv 60 % Weide %RP 17,6",94]
["DGL-TM Mähweide extensiv 20 % Weide %RP 12,4",69]
["DGL-TM Mähweide mittel 20 % Weide %RP 17,2",98]
["DGL-TM Mähweide  intensiv 20 % Weide %RP 17,5",110]
["DGL-TM Weide intensiv (4-5 Mal) %RP 18,0",90]
["DGL-TM Weide mittel  %RP 15,3",78]
["DGL-TM Weide extensiv (2-3 Mal) %RP 12,5",65]